Reaction Details
TargetMelatonin receptor type 1A
LigandBDBM50086028
Substrate/Competitorn/a
Meas. Tech.ChEMBL_105101 (CHEMBL715945)
Ki 14.5±n/a nM
Citation Faust, RGarratt, PJJones, RYeh, LKTsotinis, APanoussopoulou, MCalogeropoulou, TTeh, MTSugden, D Mapping the melatonin receptor. 6. Melatonin agonists and antagonists derived from 6H-isoindolo[2,1-a]indoles, 5,6-dihydroindolo[2,1-a]isoquinolines, and 6,7-dihydro-5H-benzo[c]azepino[2,1-a]indoles. J Med Chem43:1050-61 (2000) Melatonin receptor type 1A
Name:Melatonin receptor type 1A
Type:Enzyme
Mol. Mass.:39392.94
Organism:Homo sapiens (Human)
Description:P48039
Residue:350
BDBM50086028
NameBDBM50086028
Synonyms:CHEMBL9630 | N-[2-(2-Ethoxy-6H-isoindolo[2,1-a]indol-11-yl)-ethyl]-propionamide
TypeSmall organic molecule
Emp. Form.C22H24N2O2
Mol. Mass.348.4382
SMILESCCOc1ccc2n3Cc4ccccc4-c3c(CCNC(=O)CC)c2c1