Reaction Details
TargetAldo-keto reductase family 1 member B1
LigandBDBM16452
Substrate/Competitorn/a
Meas. Tech.ChEMBL_31330 (CHEMBL644883)
IC50 36.4±n/a nM
Citation Singh, SBMalamas, MSHohman, TCNilakantan, RCarper, DAKitchen, D Molecular modeling of the aldose reductase-inhibitor complex based on the X-ray crystal structure and studies with single-site-directed mutants. J Med Chem43:1062-70 (2000) Aldo-keto reductase family 1 member B1
Name:Aldo-keto reductase family 1 member B1
Type:Protein
Mol. Mass.:35855.50
Organism:Homo sapiens (Human)
Description:P15121. 4LAU; 2IKI; 4LB4; 2FZD; 2FZ8; 1US0
Residue:316
BDBM16452
NameBDBM16452
Synonyms:(4-oxo-3-{[5-(trifluoromethyl)-1,3-benzothiazol-2-yl]methyl}-3,4-dihydrophthalazin-1-yl)acetic acid Alond Xedia | Zopolrestat
TypeSmall organic molecule
Emp. Form.C19H12F3N3O3S
Mol. Mass.419.377
SMILESOC(=O)Cc1nn(Cc2nc3cc(ccc3s2)C(F)(F)F)c(=O)c2ccccc12