Reaction Details
TargetE-selectin
LigandBDBM50288934
Substrate/Competitorn/a
Meas. Tech.ChEMBL_199877 (CHEMBL803778)
IC50 580000±n/a nM
Citation Hiramatsu, YTsukida, TNakai, YInoue, YKondo, H Study on selectin blocker. 8. Lead discovery of a non-sugar antagonist using a 3D-pharmacophore model. J Med Chem43:1476-83 (2000) E-selectin
Name:E-selectin
Type:PROTEIN
Mol. Mass.:66749.86
Organism:Mus musculus
Description:ChEMBL_199837
Residue:612
BDBM50288934
NameBDBM50288934
Synonyms:2-[3,5-dihydroxy-2-(6-hydroxy-2-hydroxymethyl-4-oxy-(3-methyltetrahydro-2H-4,5,6-pyrantriol)-5-methylcarboxamidotetrahydro-2H-3-pyranyloxy)-6-hydroxymethyltetrahydro-2H-4-pyranyloxy]-4-hydroxy-5-methylcarboxamido-6-(1,2,3-trihydroxypropyl)tetrahydro-2H-2-pyrancarboxylic acid 5-Acetylamino-2-{2-[5-acetylamino-2-hydroxy-4-(3,4,5-trihydroxy-6-methyl-tetrahydro-pyran-2-yloxy)-tetrahydro-pyran-3-yloxy]-3,5-dihydroxy-6-hydroxymethyl-tetrahydro-pyran-4-yloxy}-4-hydroxy-6-(1,2,3-trihydroxy-propyl)-tetrahydro-pyran-2-carboxylic acid CHEMBL31535 Sialyl Lewis X Analog(sLeX) Sialyl Lewis x (sLex) sLex | sialyl Lewis X(sLe x)
TypeSmall organic molecule
Emp. Form.C31H52N2O23
Mol. Mass.820.7442
SMILESCC1OC(OC2C(NC(C)=O)C(O)OC(CO)C2OC2OC(CO)C(O)C(OC3(CC(O)C(NC(C)=O)C(O3)[C@@H](O)[C@H](O)CO)C(O)=O)C2O)C(O)C(O)C1O