Reaction Details
TargetE-selectin
LigandBDBM50087287
Substrate/Competitorn/a
Meas. Tech.ChEMBL_199877 (CHEMBL803778)
IC50 86000±n/a nM
Citation Hiramatsu, YTsukida, TNakai, YInoue, YKondo, H Study on selectin blocker. 8. Lead discovery of a non-sugar antagonist using a 3D-pharmacophore model. J Med Chem43:1476-83 (2000) E-selectin
Name:E-selectin
Type:PROTEIN
Mol. Mass.:66749.86
Organism:Mus musculus
Description:ChEMBL_199837
Residue:612
BDBM50087287
NameBDBM50087287
Synonyms:4-(3-Carboxy-phenoxy)-3-(4-octadecanoylamino-benzoylamino)-benzoic acid | CHEMBL37284
TypeSmall organic molecule
Emp. Form.C39H50N2O7
Mol. Mass.658.8235
(=O)Nc1ccc(cc1)C(=O)Nc1cc(ccc1Oc1cccc(c1)C(O)=O)C(O)=O