Reaction Details
TargetMu-type opioid receptor
LigandBDBM50026889
Substrate/Competitorn/a
Meas. Tech.ChEMBL_148094 (CHEMBL751576)
Ki 0.670000±n/a nM
Citation Coop, ANorton, CLBerzetei-Gurske, IBurnside, JToll, LHusbands, SMLewis, JW Structural determinants of opioid activity in the orvinols and related structures: ethers of orvinol and isoorvinol. J Med Chem43:1852-7 (2000) Mu-type opioid receptor
Name:Mu-type opioid receptor
Type:G Protein-Coupled Receptor (GPCR)
Mol. Mass.:44789.51
Organism:Homo sapiens (Human)
Description:P35372
Residue:400
BDBM50026889
NameBDBM50026889
Synonyms:CHEMBL2113672
TypeSmall organic molecule
Emp. Form.C29H33NO4
Mol. Mass.459.5766
SMILES[H][C@@](C)(OCc1ccccc1)[C@]1([H])C[C@]23C=C[C@]1(OC)[C@@]1([H])Oc4c5c(C[C@@]2([H])N(C)CCC315)ccc4O