Reaction Details
TargetMu-type opioid receptor
LigandBDBM50369821
Substrate/Competitorn/a
Meas. Tech.ChEMBL_145150 (CHEMBL755954)
Ki 1.5±n/a nM
Citation Coop, ANorton, CLBerzetei-Gurske, IBurnside, JToll, LHusbands, SMLewis, JW Structural determinants of opioid activity in the orvinols and related structures: ethers of orvinol and isoorvinol. J Med Chem43:1852-7 (2000) Mu-type opioid receptor
Name:Mu-type opioid receptor
Type:Enzyme Catalytic Domain
Mol. Mass.:11165.58
Organism:GUINEA PIG
Description:P97266
Residue:98
BDBM50369821
NameBDBM50369821
Synonyms:CHEMBL1169585
TypeSmall organic molecule
Emp. Form.C25H33NO4
Mol. Mass.411.5338
SMILESCCC[C@@](C)(O)[C@@H]1CC23C=C[C@]1(OC)[C@H]1Oc4c5c(CC2N(C)CCC315)ccc4O