Reaction Details
TargetMu-type opioid receptor
LigandBDBM50369823
Substrate/Competitorn/a
Meas. Tech.ChEMBL_148093 (CHEMBL751575)
Ki 4.8±n/a nM
Citation Coop, ANorton, CLBerzetei-Gurske, IBurnside, JToll, LHusbands, SMLewis, JW Structural determinants of opioid activity in the orvinols and related structures: ethers of orvinol and isoorvinol. J Med Chem43:1852-7 (2000) Mu-type opioid receptor
Name:Mu-type opioid receptor
Type:G Protein-Coupled Receptor (GPCR)
Mol. Mass.:44789.51
Organism:Homo sapiens (Human)
Description:P35372
Residue:400
BDBM50369823
NameBDBM50369823
Synonyms:CHEMBL1169582
TypeSmall organic molecule
Emp. Form.C23H29NO4
Mol. Mass.383.4807
SMILESCO[C@@H](C)[C@@H]1CC23C=C[C@]1(OC)[C@H]1Oc4c5c(CC2N(C)CCC315)ccc4O