Reaction Details
TargetDelta-type opioid receptor
LigandBDBM50369820
Substrate/Competitorn/a
Meas. Tech.ChEMBL_145308 (CHEMBL751914)
EC50 58±n/a nM
Citation Coop, ANorton, CLBerzetei-Gurske, IBurnside, JToll, LHusbands, SMLewis, JW Structural determinants of opioid activity in the orvinols and related structures: ethers of orvinol and isoorvinol. J Med Chem43:1852-7 (2000) Delta-type opioid receptor
Name:Delta-type opioid receptor
Type:G Protein-Coupled Receptor (GPCR)
Mol. Mass.:40382.98
Organism:Homo sapiens (Human)
Description:Competition binding assays were carried out using membrane preparations from transfected HN9.10 cells that constitutively expressed the delta opioid receptor.
Residue:372
BDBM50369820
NameBDBM50369820
Synonyms:CHEMBL1169584
TypeSmall organic molecule
Emp. Form.C24H31NO4
Mol. Mass.397.5072
SMILESCCO[C@@H](C)[C@@H]1CC23C=C[C@]1(OC)[C@H]1Oc4c5c(CC2N(C)CCC315)ccc4O