Reaction Details
TargetPotassium voltage-gated channel subfamily D member 3
LigandBDBM50099567
Substrate/Competitorn/a
Meas. Tech.ChEMBL_158527 (CHEMBL768954)
IC50 1400±n/a nM
Citation Coghlan, MJCarroll, WAGopalakrishnan, M Recent developments in the biology and medicinal chemistry of potassium channel modulators: update from a decade of progress. J Med Chem44:1627-53 (2001) Potassium voltage-gated channel subfamily D member 3
Name:Potassium voltage-gated channel subfamily D member 3
Type:PROTEIN
Mol. Mass.:73464.62
Organism:Homo sapiens (Human)
Description:ChEMBL_1478652
Residue:655
BDBM50099567
NameBDBM50099567
Synonyms:(3S,4R)-Ethanesulfonic acid (6-cyano-3-hydroxy-2,2-dimethyl-chroman-4-yl)-methyl-amide Ethanesulfonic acid (6-cyano-3-hydroxy-2,2-dimethyl-chroman-4-yl)-methyl-amide
TypeSmall organic molecule
Emp. Form.C15H20N2O4S
Mol. Mass.324.395
SMILESCCS(=O)(=O)N(C)[C@H]1[C@H](O)C(C)(C)Oc2ccc(cc12)C#N