Reaction Details
TargetPotassium voltage-gated channel subfamily A member 5
LigandBDBM50001786
Substrate/Competitorn/a
Meas. Tech.ChEMBL_158549 (CHEMBL768692)
IC50 2000±n/a nM
Citation Coghlan, MJCarroll, WAGopalakrishnan, M Recent developments in the biology and medicinal chemistry of potassium channel modulators: update from a decade of progress. J Med Chem44:1627-53 (2001) Potassium voltage-gated channel subfamily A member 5
Name:Potassium voltage-gated channel subfamily A member 5
Type:Enzyme
Mol. Mass.:67222.47
Organism:Homo sapiens (Human)
Description:P22460
Residue:613
BDBM50001786
NameBDBM50001786
Synonyms:1-(2-{4-[5-chloro-1-(4-fluorophenyl)-1H-indol-3-yl]piperidin-1-yl}ethyl)imidazolidin-2-one CHEMBL12713 | Sertindole
TypeSmall organic molecule
Emp. Form.C24H26ClFN4O
Mol. Mass.440.941
SMILESFc1ccc(cc1)-n1cc(C2CCN(CCN3CCNC3=O)CC2)c2cc(Cl)ccc12