Reaction Details
TargetMelanocortin receptor 4
LigandBDBM50100754
Substrate/Competitorn/a
Meas. Tech.ChEMBL_219178 (CHEMBL821689)
EC50>100000±n/a nM
Citation Haskell-Luevano, CHolder, JRMonck, EKBauzo, RM Characterization of melanocortin NDP-MSH agonist peptide fragments at the mouse central and peripheral melanocortin receptors. J Med Chem44:2247-52 (2001) Melanocortin receptor 4
Name:Melanocortin receptor 4
Type:PROTEIN
Mol. Mass.:36964.43
Organism:Mus musculus
Description:ChEMBL_1498850
Residue:332
BDBM50100754
NameBDBM50100754
Synonyms:Ac-Phe-Arg-Trp-NH2 | CHEMBL441988
TypeSmall organic molecule
Emp. Form.C28H36N8O4
Mol. Mass.548.6366
SMILESCC(=O)N[C@@H](Cc1ccccc1)C(=O)N[C@@H](CCCNC(N)=N)C(=O)N[C@@H](Cc1c[nH]c2ccccc12)C(N)=O