Reaction Details
TargetMelanocyte-stimulating hormone receptor
LigandBDBM50100756
Substrate/Competitorn/a
Meas. Tech.ChEMBL_219174 (CHEMBL821685)
EC50 0.045±n/a nM
Citation Haskell-Luevano, CHolder, JRMonck, EKBauzo, RM Characterization of melanocortin NDP-MSH agonist peptide fragments at the mouse central and peripheral melanocortin receptors. J Med Chem44:2247-52 (2001) Melanocyte-stimulating hormone receptor
Name:Melanocyte-stimulating hormone receptor
Type:PROTEIN
Mol. Mass.:35238.60
Organism:Mus musculus
Description:ChEMBL_1498846
Residue:315
BDBM50100756
NameBDBM50100756
Synonyms:Ac-Nle-Glu-His-DPhe-Arg-Trp-Gly-NH2 | CHEMBL264536
TypeSmall organic molecule
Emp. Form.C47H64N14O10
Mol. Mass.985.0989
SMILESCCCC[C@H](NC(C)=O)C(=O)N[C@@H](CCC(O)=O)C(=O)N[C@@H](Cc1cnc[nH]1)C(=O)N[C@H](Cc1ccccc1)C(=O)N[C@@H](CCCNC(N)=N)C(=O)N[C@@H](Cc1c[nH]c2ccccc12)C(=O)NCC(N)=O