Reaction Details
TargetMelanocortin receptor 3
LigandBDBM50100752
Substrate/Competitorn/a
Meas. Tech.ChEMBL_219176 (CHEMBL821687)
EC50 0.11±n/a nM
Citation Haskell-Luevano, CHolder, JRMonck, EKBauzo, RM Characterization of melanocortin NDP-MSH agonist peptide fragments at the mouse central and peripheral melanocortin receptors. J Med Chem44:2247-52 (2001) Melanocortin receptor 3
Name:Melanocortin receptor 3
Type:PROTEIN
Mol. Mass.:35808.24
Organism:Mus musculus
Description:ChEMBL_1498848
Residue:323
BDBM50100752
NameBDBM50100752
Synonyms:Ac-Nle-Glu-His-DPhe-Arg-Trp-Gly-Lys-Pro-Val-NH2 | CHEMBL429236
TypeSmall organic molecule
Emp. Form.C63H92N18O13
Mol. Mass.1309.5174
SMILESCCCC[C@H](NC(C)=O)C(=O)N[C@@H](CCC(O)=O)C(=O)N[C@@H](Cc1cnc[nH]1)C(=O)N[C@H](Cc1ccccc1)C(=O)N[C@@H](CCCNC(N)=N)C(=O)N[C@@H](Cc1c[nH]c2ccccc12)C(=O)NCC(=O)N[C@@H](CCCCN)C(=O)N1CCC[C@H]1C(=O)N[C@@H](C(C)C)C(N)=O