Reaction Details
TargetMelanocyte-stimulating hormone receptor
LigandBDBM50034912
Substrate/Competitorn/a
Meas. Tech.ChEMBL_219174 (CHEMBL821685)
EC50 4540±n/a nM
Citation Haskell-Luevano, CHolder, JRMonck, EKBauzo, RM Characterization of melanocortin NDP-MSH agonist peptide fragments at the mouse central and peripheral melanocortin receptors. J Med Chem44:2247-52 (2001) Melanocyte-stimulating hormone receptor
Name:Melanocyte-stimulating hormone receptor
Type:PROTEIN
Mol. Mass.:35238.60
Organism:Mus musculus
Description:ChEMBL_1498846
Residue:315
BDBM50034912
NameBDBM50034912
Synonyms:(S)-2-((R)-2-Acetylamino-3-phenyl-propionylamino)-5-guanidino-pentanoic acid [(S)-1-carbamoyl-2-(1H-indol-3-yl)-ethyl]-amide CHEMBL432895
TypeSmall organic molecule
Emp. Form.C28H36N8O4
Mol. Mass.548.6366
SMILESCC(=O)N[C@H](Cc1ccccc1)C(=O)N[C@@H](CCCNC(N)=N)C(=O)N[C@@H](Cc1c[nH]c2ccccc12)C(N)=O