Reaction Details
TargetMelanocyte-stimulating hormone receptor
LigandBDBM50100757
Substrate/Competitorn/a
Meas. Tech.ChEMBL_219174 (CHEMBL821685)
EC50 0.018±n/a nM
Citation Haskell-Luevano, CHolder, JRMonck, EKBauzo, RM Characterization of melanocortin NDP-MSH agonist peptide fragments at the mouse central and peripheral melanocortin receptors. J Med Chem44:2247-52 (2001) Melanocyte-stimulating hormone receptor
Name:Melanocyte-stimulating hormone receptor
Type:PROTEIN
Mol. Mass.:35238.60
Organism:Mus musculus
Description:ChEMBL_1498846
Residue:315
BDBM50100757
NameBDBM50100757
Synonyms:Ac-Ser-Tyr-Ser-Nle-Glu-His-DPhe-Arg-Trp-Gly-Lys-NH2 | CHEMBL386081
TypeSmall organic molecule
Emp. Form.C68H95N19O17
Mol. Mass.1450.599
SMILESCCCC[C@H](NC(=O)[C@H](CO)NC(=O)[C@H](Cc1ccc(O)cc1)NC(=O)[C@H](CO)NC(C)=O)C(=O)N[C@@H](CCC(O)=O)C(=O)N[C@@H](Cc1cnc[nH]1)C(=O)N[C@H](Cc1ccccc1)C(=O)N[C@@H](CCCNC(N)=N)C(=O)N[C@@H](Cc1c[nH]c2ccccc12)C(=O)NCC(=O)N[C@@H](CCCCN)C(N)=O