Reaction Details
TargetMelanocyte-stimulating hormone receptor
LigandBDBM50058963
Substrate/Competitorn/a
Meas. Tech.ChEMBL_219174 (CHEMBL821685)
EC50 97.20±n/a nM
Citation Haskell-Luevano, CHolder, JRMonck, EKBauzo, RM Characterization of melanocortin NDP-MSH agonist peptide fragments at the mouse central and peripheral melanocortin receptors. J Med Chem44:2247-52 (2001) Melanocyte-stimulating hormone receptor
Name:Melanocyte-stimulating hormone receptor
Type:PROTEIN
Mol. Mass.:35238.60
Organism:Mus musculus
Description:ChEMBL_1498846
Residue:315
BDBM50058963
NameBDBM50058963
Synonyms:Ac-His-DPhe-Arg-DTrp-NH2 CHEMBL433296
TypeSmall organic molecule
Emp. Form.C34H43N11O5
Mol. Mass.685.7759
SMILESCC(=O)N[C@@H](Cc1cnc[nH]1)C(=O)N[C@H](Cc1ccccc1)C(=O)N[C@@H](CCCNC(N)=N)C(=O)N[C@H](Cc1c[nH]c2ccccc12)C(N)=O