Reaction Details
TargetMelanocortin receptor 4
LigandBDBM50100753
Substrate/Competitorn/a
Meas. Tech.ChEMBL_219178 (CHEMBL821689)
EC50 0.780±n/a nM
Citation Haskell-Luevano, CHolder, JRMonck, EKBauzo, RM Characterization of melanocortin NDP-MSH agonist peptide fragments at the mouse central and peripheral melanocortin receptors. J Med Chem44:2247-52 (2001) Melanocortin receptor 4
Name:Melanocortin receptor 4
Type:PROTEIN
Mol. Mass.:36964.43
Organism:Mus musculus
Description:ChEMBL_1498850
Residue:332
BDBM50100753
NameBDBM50100753
Synonyms:Ac-Ser-Tyr-Ser-Nle-Glu-His-DPhe-Arg-Trp-NH2 | CHEMBL410763
TypeSmall organic molecule
Emp. Form.C60H80N16O15
Mol. Mass.1265.3754
SMILESCCCC[C@H](NC(=O)[C@H](CO)NC(=O)[C@H](Cc1ccc(O)cc1)NC(=O)[C@H](CO)NC(C)=O)C(=O)N[C@@H](CCC(O)=O)C(=O)N[C@@H](Cc1cnc[nH]1)C(=O)N[C@H](Cc1ccccc1)C(=O)N[C@@H](CCCNC(N)=N)C(=O)N[C@@H](Cc1c[nH]c2ccccc12)C(N)=O