Reaction Details
TargetMelanocyte-stimulating hormone receptor
LigandBDBM50100755
Substrate/Competitorn/a
Meas. Tech.ChEMBL_219174 (CHEMBL821685)
EC50 0.490±n/a nM
Citation Haskell-Luevano, CHolder, JRMonck, EKBauzo, RM Characterization of melanocortin NDP-MSH agonist peptide fragments at the mouse central and peripheral melanocortin receptors. J Med Chem44:2247-52 (2001) Melanocyte-stimulating hormone receptor
Name:Melanocyte-stimulating hormone receptor
Type:PROTEIN
Mol. Mass.:35238.60
Organism:Mus musculus
Description:ChEMBL_1498846
Residue:315
BDBM50100755
NameBDBM50100755
Synonyms:Ac-His-DPhe-Arg-Trp-Gly-Lys-Pro-Val-NH2 | CHEMBL405335
TypeSmall organic molecule
Emp. Form.C52H74N16O9
Mol. Mass.1067.2458
SMILESCC(C)[C@H](NC(=O)[C@@H]1CCCN1C(=O)[C@H](CCCCN)NC(=O)CNC(=O)[C@H](Cc1c[nH]c2ccccc12)NC(=O)[C@H](CCCNC(N)=N)NC(=O)[C@@H](Cc1ccccc1)NC(=O)[C@H](Cc1cnc[nH]1)NC(C)=O)C(N)=O