Reaction Details
TargetMelanocortin receptor 5
LigandBDBM50058958
Substrate/Competitorn/a
Meas. Tech.ChEMBL_219179 (CHEMBL821690)
EC50 317±n/a nM
Citation Haskell-Luevano, CHolder, JRMonck, EKBauzo, RM Characterization of melanocortin NDP-MSH agonist peptide fragments at the mouse central and peripheral melanocortin receptors. J Med Chem44:2247-52 (2001) Melanocortin receptor 5
Name:Melanocortin receptor 5
Type:Enzyme
Mol. Mass.:36966.58
Organism:Mus musculus (Mouse)
Description:P41149
Residue:325
BDBM50058958
NameBDBM50058958
Synonyms:2-{2-[2-Acetylamino-3-(1H-imidazol-4-yl)-propionylamino]-3-phenyl-propionylamino}-5-guanidino-pentanoic acid [1-carbamoyl-2-(1H-indol-3-yl)-ethyl]-amideAc-His-Phe-Arg-DTrp-NH2 CHEMBL302703
TypeSmall organic molecule
Emp. Form.C34H43N11O5
Mol. Mass.685.7759
SMILESCC(=O)N[C@@H](Cc1cnc[nH]1)C(=O)N[C@@H](Cc1ccccc1)C(=O)N[C@@H](CCCNC(N)=N)C(=O)N[C@H](Cc1c[nH]c2ccccc12)C(N)=O