Reaction Details
TargetInterstitial collagenase
LigandBDBM50076993
Substrate/Competitorn/a
Meas. Tech.ChEMBL_106154 (CHEMBL718850)
Ki<1±n/a nM
Citation Xue, CBVoss, MENelson, DJDuan, JJCherney, RJJacobson, ICHe, XRoderick, JChen, LCorbett, RLWang, LMeyer, DTKennedy, KDeGradodagger, WFHardman, KDTeleha, CAJaffee, BDLiu, RQCopeland, RACovington, MBChrist, DDTrzaskos, JMNewton, RCMagolda, RLWexler, RRDecicco, CP Design, synthesis, and structure-activity relationships of macrocyclic hydroxamic acids that inhibit tumor necrosis factor alpha release in vitro and in vivo. J Med Chem44:2636-60 (2001) Interstitial collagenase
Name:Interstitial collagenase
Type:Enzyme
Mol. Mass.:54010.26
Organism:Homo sapiens (Human)
Description: P03956
Residue:469
BDBM50076993
NameBDBM50076993
Synonyms:(2S,11S,12R)-12-Isobutyl-13-oxo-1,7diaza-cyclotridecane-2,11-dicarboxylic acid 11-hydroxyamide 2-methylamide; hydrochloride CHEMBL88220
TypeSmall organic molecule
Emp. Form.C18H34N4O4
Mol. Mass.370.487
SMILESCNC(=O)[C@@H]1CCCCNCCC[C@@H]([C@@H](CC(C)C)C(=O)N1)C(=O)NO