Reaction Details
TargetMatrix metalloproteinase-9
LigandBDBM50102640
Substrate/Competitorn/a
Meas. Tech.ChEMBL_105380 (CHEMBL710800)
Ki 3.6±n/a nM
Citation Xue, CBVoss, MENelson, DJDuan, JJCherney, RJJacobson, ICHe, XRoderick, JChen, LCorbett, RLWang, LMeyer, DTKennedy, KDeGradodagger, WFHardman, KDTeleha, CAJaffee, BDLiu, RQCopeland, RACovington, MBChrist, DDTrzaskos, JMNewton, RCMagolda, RLWexler, RRDecicco, CP Design, synthesis, and structure-activity relationships of macrocyclic hydroxamic acids that inhibit tumor necrosis factor alpha release in vitro and in vivo. J Med Chem44:2636-60 (2001) Matrix metalloproteinase-9
Name:Matrix metalloproteinase-9
Type:Enzyme
Mol. Mass.:78452.28
Organism:Homo sapiens (Human)
Description:P14780
Residue:707
BDBM50102640
NameBDBM50102640
Synonyms:12-Isobutyl-8,13-dioxo-1,7diaza-cyclotridecane-2,11-dicarboxylic acid 11-hydroxyamide 2-methylamide | CHEMBL90337
TypeSmall organic molecule
Emp. Form.C18H32N4O5
Mol. Mass.384.4705
SMILESCNC(=O)[C@@H]1CCCCNC(=O)CC[C@@H]([C@@H](CC(C)C)C(=O)N1)C(=O)NO