Reaction Details
TargetDisintegrin and metalloproteinase domain-containing protein 17
LigandBDBM50102630
Substrate/Competitorn/a
Meas. Tech.ChEMBL_89920 (CHEMBL702337)
IC50 2300±n/a nM
Citation Xue, CBVoss, MENelson, DJDuan, JJCherney, RJJacobson, ICHe, XRoderick, JChen, LCorbett, RLWang, LMeyer, DTKennedy, KDeGradodagger, WFHardman, KDTeleha, CAJaffee, BDLiu, RQCopeland, RACovington, MBChrist, DDTrzaskos, JMNewton, RCMagolda, RLWexler, RRDecicco, CP Design, synthesis, and structure-activity relationships of macrocyclic hydroxamic acids that inhibit tumor necrosis factor alpha release in vitro and in vivo. J Med Chem44:2636-60 (2001) Disintegrin and metalloproteinase domain-containing protein 17
Name:Disintegrin and metalloproteinase domain-containing protein 17
Type:Enzyme
Mol. Mass.:93007.89
Organism:Homo sapiens (Human)
Description:
Residue:824
BDBM50102630
NameBDBM50102630
Synonyms:11-Isobutyl-3-methyl-2,10-dioxo-1-oxa-3,9-diaza-cyclopentadecane-8,12-dicarboxylic acid 12-hydroxyamide 8-methylamide | CHEMBL88427
TypeSmall organic molecule
Emp. Form.C20H36N4O6
Mol. Mass.428.523
SMILESCNC(=O)[C@@H]1CCCCN(C)C(=O)OCCC[C@@H]([C@@H](CC(C)C)C(=O)N1)C(=O)NO