Reaction Details
TargetDisintegrin and metalloproteinase domain-containing protein 17
LigandBDBM50102658
Substrate/Competitorn/a
Meas. Tech.ChEMBL_89920 (CHEMBL702337)
IC50 2400±n/a nM
Citation Xue, CBVoss, MENelson, DJDuan, JJCherney, RJJacobson, ICHe, XRoderick, JChen, LCorbett, RLWang, LMeyer, DTKennedy, KDeGradodagger, WFHardman, KDTeleha, CAJaffee, BDLiu, RQCopeland, RACovington, MBChrist, DDTrzaskos, JMNewton, RCMagolda, RLWexler, RRDecicco, CP Design, synthesis, and structure-activity relationships of macrocyclic hydroxamic acids that inhibit tumor necrosis factor alpha release in vitro and in vivo. J Med Chem44:2636-60 (2001) Disintegrin and metalloproteinase domain-containing protein 17
Name:Disintegrin and metalloproteinase domain-containing protein 17
Type:Enzyme
Mol. Mass.:93007.89
Organism:Homo sapiens (Human)
Description:
Residue:824
BDBM50102658
NameBDBM50102658
Synonyms:7-Isobutyl-8-oxo-2-oxa-9-aza-bicyclo[12.2.2]octadeca-1(17),14(18),15-triene-6,10-dicarboxylic acid 6-hydroxyamide 10-methylamide | CHEMBL328090
TypeSmall organic molecule
Emp. Form.C23H35N3O5
Mol. Mass.433.5411
SMILESCNC(=O)[C@@H]1CCCc2ccc(OCCC[C@@H]([C@@H](CC(C)C)C(=O)N1)C(=O)NO)cc2