Reaction Details
TargetNitric oxide synthase, brain
LigandBDBM50102683
Substrate/Competitorn/a
Meas. Tech.ChEMBL_223229 (CHEMBL843813)
Ki 290±n/a nM
Citation Hah, JMRoman, LJMartásek, PSilverman, RB Reduced amide bond peptidomimetics. (4S)-N-(4-amino-5-[aminoakyl]aminopentyl)-N'-nitroguanidines, potent and highly selective inhibitors of neuronal nitric oxide synthase. J Med Chem44:2667-70 (2001) Nitric oxide synthase, brain
Name:Nitric oxide synthase, brain
Type:Enzyme
Mol. Mass.:160570.98
Organism:Rattus norvegicus (rat)
Description:Recombinant nNOS overexpressed in E. coli was used in enzyme assays.
Residue:1429
BDBM50102683
NameBDBM50102683
Synonyms:CHEMBL313228 | N-{(4S)-4-amino-5-[(3-aminopropyl)amino]pentyl}-N'-nitroguanidine
TypeSmall organic molecule
Emp. Form.C9H23N7O2
Mol. Mass.261.3246
SMILESNCCCNC[C@@H](N)CCCNC(=N)N[N+]([O-])=O