Reaction Details
TargetD(3) dopamine receptor
LigandBDBM50104122
Substrate/Competitorn/a
Meas. Tech.ChEMBL_62125 (CHEMBL673446)
Ki 1.4±n/a nM
Citation Robarge, MJHusbands, SMKieltyka, ABrodbeck, RThurkauf, ANewman, AH Design and synthesis of [(2,3-dichlorophenyl)piperazin-1-yl]alkylfluorenylcarboxamides as novel ligands selective for the dopamine D3 receptor subtype. J Med Chem44:3175-86 (2001) D(3) dopamine receptor
Name:D(3) dopamine receptor
Type:n/a
Mol. Mass.:44243.43
Organism:Homo sapiens (Human)
Description:n/a
Residue:400
BDBM50104122
NameBDBM50104122
Synonyms:9-Oxo-9H-fluorene-4-carboxylic acid {4-[4-(2,3-dichloro-phenyl)-piperazin-1-yl]-butyl}-amide | CHEMBL301242
TypeSmall organic molecule
Emp. Form.C28H27Cl2N3O2
Mol. Mass.508.439
SMILESClc1cccc(N2CCN(CCCCNC(=O)c3cccc4C(=O)c5ccccc5-c34)CC2)c1Cl