Reaction Details
TargetD(2) dopamine receptor
LigandBDBM50071958
Substrate/Competitorn/a
Meas. Tech.ChEMBL_60071 (CHEMBL671385)
Ki 262±n/a nM
Citation Robarge, MJHusbands, SMKieltyka, ABrodbeck, RThurkauf, ANewman, AH Design and synthesis of [(2,3-dichlorophenyl)piperazin-1-yl]alkylfluorenylcarboxamides as novel ligands selective for the dopamine D3 receptor subtype. J Med Chem44:3175-86 (2001) D(2) dopamine receptor
Name:D(2) dopamine receptor
Type:Cell-surface receptors
Mol. Mass.:50647.10
Organism:Homo sapiens (Human)
Description:P14416
Residue:443
BDBM50071958
NameBDBM50071958
Synonyms:Biphenylene-2-carboxylic acid {4-[4-(2,3-dichloro-phenyl)-piperazin-1-yl]-butyl}-amide | CHEMBL419505
TypeSmall organic molecule
Emp. Form.C27H27Cl2N3O
Mol. Mass.480.429
SMILESClc1cccc(N2CCN(CCCCNC(=O)c3ccc4-c5ccccc5-c4c3)CC2)c1Cl