Reaction Details
Target5-hydroxytryptamine receptor 1A
LigandBDBM50095801
Substrate/Competitorn/a
Meas. Tech.ChEMBL_1419 (CHEMBL616207)
Ki 2.2±n/a nM
Citation López-Rodríguez, MLMorcillo, MJFernández, ERosado, MLPardo, LSchaper, K Synthesis and structure-activity relationships of a new model of arylpiperazines. Study of the 5-HT(1a)/alpha(1)-adrenergic receptor affinity by classical hansch analysis, artificial neural networks, and computational simulation of ligand recognition. J Med Chem44:198-207 (2001) 5-hydroxytryptamine receptor 1A
Name:5-hydroxytryptamine receptor 1A
Type:G Protein-Coupled Receptor (GPCR)
Mol. Mass.:46445.29
Organism:Rattus norvegicus (rat)
Description:Binding assays were performed using rat hippocampal membranes.
Residue:422
BDBM50095801
NameBDBM50095801
Synonyms:2-{4-[4-(2-Butoxy-phenyl)-piperazin-1-yl]-butyl}-tetrahydro-imidazo[1,5-a]pyridine-1,3-dione CHEMBL61545
TypeSmall organic molecule
Emp. Form.C25H38N4O3
Mol. Mass.442.5942
SMILESCCCCOc1ccccc1N1CCN(CCCCn2c(O)c3CCCCn3c2=O)CC1