Reaction Details
Target2-oxoglutarate receptor 1
LigandBDBM50369932
Substrate/Competitorn/a
Meas. Tech.ChEMBL_151406 (CHEMBL754752)
Ki 41±n/a nM
Citation Umino, TYoshioka, KSaitoh, YMinakawa, NNakata, HMatsuda, A Nucleosides and nucleotides. 200. Reinvestigation of 5'-N-ethylcarboxamidoadenosine derivatives: structure-activity relationships for P(3) purinoceptor-like proteins. J Med Chem44:208-14 (2001) 2-oxoglutarate receptor 1
Name:2-oxoglutarate receptor 1
Type:PROTEIN
Mol. Mass.:38385.93
Organism:Rattus norvegicus
Description:ChEMBL_151406
Residue:337
BDBM50369932
NameBDBM50369932
Synonyms:CHEMBL608595
TypeSmall organic molecule
Emp. Form.C10H12N6O5
Mol. Mass.296.2395
SMILESNc1ncnc2n(cnc12)C1O[C@@H]([C@@H](O)[C@H]1O)C(=O)NO