Reaction Details
Target2-oxoglutarate receptor 1
LigandBDBM50369940
Substrate/Competitorn/a
Meas. Tech.ChEMBL_151406 (CHEMBL754752)
Ki 1040±n/a nM
Citation Umino, TYoshioka, KSaitoh, YMinakawa, NNakata, HMatsuda, A Nucleosides and nucleotides. 200. Reinvestigation of 5'-N-ethylcarboxamidoadenosine derivatives: structure-activity relationships for P(3) purinoceptor-like proteins. J Med Chem44:208-14 (2001) 2-oxoglutarate receptor 1
Name:2-oxoglutarate receptor 1
Type:PROTEIN
Mol. Mass.:38385.93
Organism:Rattus norvegicus
Description:ChEMBL_151406
Residue:337
BDBM50369940
NameBDBM50369940
Synonyms:CHEMBL608000
TypeSmall organic molecule
Emp. Form.C20H26N6O4
Mol. Mass.414.4582
SMILESNc1ncnc2n(cnc12)C1O[C@@H]([C@@H](O)[C@H]1O)C(=O)NC12CC3CC(CC(C3)C1)C2