Reaction Details
Target2-oxoglutarate receptor 1
LigandBDBM50369952
Substrate/Competitorn/a
Meas. Tech.ChEMBL_151406 (CHEMBL754752)
Ki 10±n/a nM
Citation Umino, TYoshioka, KSaitoh, YMinakawa, NNakata, HMatsuda, A Nucleosides and nucleotides. 200. Reinvestigation of 5'-N-ethylcarboxamidoadenosine derivatives: structure-activity relationships for P(3) purinoceptor-like proteins. J Med Chem44:208-14 (2001) 2-oxoglutarate receptor 1
Name:2-oxoglutarate receptor 1
Type:PROTEIN
Mol. Mass.:38385.93
Organism:Rattus norvegicus
Description:ChEMBL_151406
Residue:337
BDBM50369952
NameBDBM50369952
Synonyms:CHEMBL609487
TypeSmall organic molecule
Emp. Form.C20H31N7O5
Mol. Mass.449.504
SMILESCC(=O)NCCCCCCCCNC(=O)[C@H]1OC([C@H](O)[C@@H]1O)n1cnc2c(N)ncnc12