Reaction Details
TargetE-selectin
LigandBDBM50422365
Substrate/Competitorn/a
Meas. Tech.ChEMBL_199857 (CHEMBL804921)
IC50 80000±n/a nM
Citation Fazli, ABradley, SJKiefel, MJJolly, CHolmes, IHvon Itzstein, M Synthesis and biological evaluation of sialylmimetics as rotavirus inhibitors. J Med Chem44:3292-301 (2001) E-selectin
Name:E-selectin
Type:PROTEIN
Mol. Mass.:66642.96
Organism:Homo sapiens (Human)
Description:ChEMBL_1438995
Residue:610
BDBM50422365
NameBDBM50422365
Synonyms:CHEMBL2303822
TypeSmall organic molecule
Emp. Form.C27H46O13
Mol. Mass.578.6463
SMILESC[C@@H]1O[C@@H](O[C@@H]2CCCC[C@H]2O[C@@H]2O[C@@H](CO)[C@H](O)[C@H](O[C@@H](CC3CCCCC3)C(O)=O)[C@@H]2O)[C@@H](O)[C@@H](O)[C@@H]1O