Reaction Details
TargetEndothelin-1 receptor
LigandBDBM50105051
Substrate/Competitorn/a
Meas. Tech.ChEMBL_65793 (CHEMBL677974)
IC50 0.0062±n/a nM
Citation Morimoto, HOhashi, NShimadzu, HKushiyama, EKawanishi, HHosaka, TKawase, YYasuda, KKikkawa, KYamauchi-Kohno, RYamada, K Potent and selective ET-A antagonists. 2. Discovery and evaluation of potent and water soluble N-(6-(2-(aryloxy)ethoxy)-4-pyrimidinyl)sulfonamide derivatives. J Med Chem44:3369-77 (2001) Endothelin-1 receptor
Name:Endothelin-1 receptor
Type:PROTEIN
Mol. Mass.:48707.29
Organism:Sus scrofa
Description:ChEMBL_65803
Residue:427
BDBM50105051
NameBDBM50105051
Synonyms:CHEMBL112624 | N-{6-[2-(5-Bromo-pyrimidin-2-yloxy)-ethoxy]-5-p-tolyl-pyrimidin-4-yl}-4-(2-hydroxy-1,1-dimethyl-ethyl)-benzenesulfonamide
TypeSmall organic molecule
Emp. Form.C27H28BrN5O5S
Mol. Mass.614.511
SMILESCc1ccc(cc1)-c1c(NS(=O)(=O)c2ccc(cc2)C(C)(C)CO)ncnc1OCCOc1ncc(Br)cn1