Reaction Details
TargetEndothelin-1 receptor
LigandBDBM50105052
Substrate/Competitorn/a
Meas. Tech.ChEMBL_65793 (CHEMBL677974)
IC50>10±n/a nM
Citation Morimoto, HOhashi, NShimadzu, HKushiyama, EKawanishi, HHosaka, TKawase, YYasuda, KKikkawa, KYamauchi-Kohno, RYamada, K Potent and selective ET-A antagonists. 2. Discovery and evaluation of potent and water soluble N-(6-(2-(aryloxy)ethoxy)-4-pyrimidinyl)sulfonamide derivatives. J Med Chem44:3369-77 (2001) Endothelin-1 receptor
Name:Endothelin-1 receptor
Type:PROTEIN
Mol. Mass.:48707.29
Organism:Sus scrofa
Description:ChEMBL_65803
Residue:427
BDBM50105052
NameBDBM50105052
Synonyms:2-{2-[6-(4-tert-Butyl-benzenesulfonylamino)-5-p-tolyl-pyrimidin-4-yloxy]-ethoxy}-pyrimidine-5-carboxylic acid. 0.6H2O | CHEMBL324613
TypeSmall organic molecule
Emp. Form.C28H29N5O6S
Mol. Mass.563.625
SMILESCc1ccc(cc1)-c1c(NS(=O)(=O)c2ccc(cc2)C(C)(C)C)ncnc1OCCOc1ncc(cn1)C(O)=O