Reaction Details
TargetEndothelin-1 receptor
LigandBDBM50105059
Substrate/Competitorn/a
Meas. Tech.ChEMBL_65793 (CHEMBL677974)
IC50 1.4±n/a nM
Citation Morimoto, HOhashi, NShimadzu, HKushiyama, EKawanishi, HHosaka, TKawase, YYasuda, KKikkawa, KYamauchi-Kohno, RYamada, K Potent and selective ET-A antagonists. 2. Discovery and evaluation of potent and water soluble N-(6-(2-(aryloxy)ethoxy)-4-pyrimidinyl)sulfonamide derivatives. J Med Chem44:3369-77 (2001) Endothelin-1 receptor
Name:Endothelin-1 receptor
Type:PROTEIN
Mol. Mass.:48707.29
Organism:Sus scrofa
Description:ChEMBL_65803
Residue:427
BDBM50105059
NameBDBM50105059
Synonyms:2-(4-{6-[2-(5-Bromo-pyrimidin-2-yloxy)-ethoxy]-5-p-tolyl-pyrimidin-4-ylsulfamoyl}-phenyl)-2-methyl-propionic acid. CH2Cl2 | CHEMBL115147
TypeSmall organic molecule
Emp. Form.C27H26BrN5O6S
Mol. Mass.628.494
SMILESCc1ccc(cc1)-c1c(NS(=O)(=O)c2ccc(cc2)C(C)(C)C(O)=O)ncnc1OCCOc1ncc(Br)cn1