Reaction Details
TargetEndothelin-1 receptor
LigandBDBM50369954
Substrate/Competitorn/a
Meas. Tech.ChEMBL_63218 (CHEMBL674070)
IC50 0.034±n/a nM
Citation Morimoto, HOhashi, NShimadzu, HKushiyama, EKawanishi, HHosaka, TKawase, YYasuda, KKikkawa, KYamauchi-Kohno, RYamada, K Potent and selective ET-A antagonists. 2. Discovery and evaluation of potent and water soluble N-(6-(2-(aryloxy)ethoxy)-4-pyrimidinyl)sulfonamide derivatives. J Med Chem44:3369-77 (2001) Endothelin-1 receptor
Name:Endothelin-1 receptor
Type:Enzyme Catalytic Domain
Mol. Mass.:48256.91
Organism:RAT
Description:ENDOTHELIN A EDNRA RAT::P26684
Residue:426
BDBM50369954
NameBDBM50369954
Synonyms:CHEMBL1627023
TypeSmall organic molecule
Emp. Form.C28H30N5O5S
Mol. Mass.548.634
SMILESCc1ccc(cc1)-c1c([N-]S(=O)(=O)c2ccc(cc2)C(C)(C)C)ncnc1OCCOc1ncc(CO)cn1