Reaction Details
TargetAdenosine receptor A3
LigandBDBM50106539
Substrate/Competitorn/a
Meas. Tech.ChEMBL_31710 (CHEMBL873053)
Ki 9.6±n/a nM
Citation Jacobson, KAGao, ZGChen, ABarak, DKim, SALee, KLink, ARompaey, PVvan Calenbergh, SLiang, BT Neoceptor concept based on molecular complementarity in GPCRs: a mutant adenosine A(3) receptor with selectively enhanced affinity for amine-modified nucleosides. J Med Chem44:4125-36 (2001) Adenosine receptor A3
Name:Adenosine receptor A3
Type:G Protein-Coupled Receptor (GPCR)
Mol. Mass.:36197.32
Organism:Homo sapiens (Human)
Description:P0DMS8
Residue:318
BDBM50106539
NameBDBM50106539
Synonyms:(2S,3S,4R,5R)-5-(6-Amino-purin-9-yl)-3,4-dihydroxy-tetrahydro-furan-2-carboxylic acid (2-amino-ethyl)-amide 5'-N-[(2-AMINO)ETHYL CARBOXAMIDO] ADENOSINE Adenosine analog, 1 | CHEMBL129903
TypeSmall organic molecule
Emp. Form.C12H17N7O4
Mol. Mass.323.3079
SMILESNCCNC(=O)[C@H]1O[C@H]([C@H](O)[C@@H]1O)n1cnc2c(N)ncnc12