Reaction Details
TargetAdenosine receptor A3
LigandBDBM50009525
Substrate/Competitorn/a
Meas. Tech.ChEMBL_31710 (CHEMBL873053)
Ki 11600±n/a nM
Citation Jacobson, KAGao, ZGChen, ABarak, DKim, SALee, KLink, ARompaey, PVvan Calenbergh, SLiang, BT Neoceptor concept based on molecular complementarity in GPCRs: a mutant adenosine A(3) receptor with selectively enhanced affinity for amine-modified nucleosides. J Med Chem44:4125-36 (2001) Adenosine receptor A3
Name:Adenosine receptor A3
Type:G Protein-Coupled Receptor (GPCR)
Mol. Mass.:36197.32
Organism:Homo sapiens (Human)
Description:P0DMS8
Residue:318
BDBM50009525
NameBDBM50009525
Synonyms:2-CI Adenosine 2-Chloroado CHEMBL285819
TypeSmall organic molecule
Emp. Form.C10H12ClN5O4
Mol. Mass.301.686
SMILESNc1nc(Cl)nc2n(cnc12)[C@@H]1O[C@H](CO)[C@@H](O)[C@H]1O