Reaction Details
TargetCannabinoid receptor 2
LigandBDBM50107597
Substrate/Competitorn/a
Meas. Tech.ChEMBL_46986 (CHEMBL658955)
Ki 70±n/a nM
Citation López-Rodríguez, MLViso, AOrtega-Gutiérrez, SLastres-Becker, IGonzález, SFernández-Ruiz, JRamos, JA Design, synthesis and biological evaluation of novel arachidonic acid derivatives as highly potent and selective endocannabinoid transporter inhibitors. J Med Chem44:4505-8 (2001) Cannabinoid receptor 2
Name:Cannabinoid receptor 2
Type:G Protein-Coupled Receptor (GPCR)
Mol. Mass.:39690.94
Organism:Homo sapiens (Human)
Description:P34972
Residue:360
BDBM50107597
NameBDBM50107597
Synonyms:(5Z,8Z,11Z,14Z)-Icosa-5,8,11,14-tetraenoic acid (1-methyl-1H-pyrrol-2-ylmethyl)-amide Icosa-5,8,11,14-tetraenoic acid (1-methyl-1H-pyrrol-2-ylmethyl)-amide
TypeSmall organic molecule
Emp. Form.C26H40N2O
Mol. Mass.396.6086
SMILESCCCCC\C=C/C\C=C/C\C=C/C\C=C/CCCC(=O)NCc1cccn1C