Reaction Details
TargetCannabinoid receptor 2
LigandBDBM50107603
Substrate/Competitorn/a
Meas. Tech.ChEMBL_46986 (CHEMBL658955)
Ki>1000±n/a nM
Citation López-Rodríguez, MLViso, AOrtega-Gutiérrez, SLastres-Becker, IGonzález, SFernández-Ruiz, JRamos, JA Design, synthesis and biological evaluation of novel arachidonic acid derivatives as highly potent and selective endocannabinoid transporter inhibitors. J Med Chem44:4505-8 (2001) Cannabinoid receptor 2
Name:Cannabinoid receptor 2
Type:G Protein-Coupled Receptor (GPCR)
Mol. Mass.:39690.94
Organism:Homo sapiens (Human)
Description:P34972
Residue:360
BDBM50107603
NameBDBM50107603
Synonyms:(5Z,8Z,11Z,14Z)-Icosa-5,8,11,14-tetraenoic acid furan-3-ylmethyl ester Icosa-5,8,11,14-tetraenoic acid furan-3-ylmethyl ester
TypeSmall organic molecule
Emp. Form.C25H36O3
Mol. Mass.384.5515
SMILESCCCCC\C=C/C\C=C/C\C=C/C\C=C/CCCC(=O)OCc1ccoc1