Reaction Details
TargetCannabinoid receptor 1
LigandBDBM50107600
Substrate/Competitorn/a
Meas. Tech.ChEMBL_46646 (CHEMBL658901)
Ki>1000±n/a nM
Citation López-Rodríguez, MLViso, AOrtega-Gutiérrez, SLastres-Becker, IGonzález, SFernández-Ruiz, JRamos, JA Design, synthesis and biological evaluation of novel arachidonic acid derivatives as highly potent and selective endocannabinoid transporter inhibitors. J Med Chem44:4505-8 (2001) Cannabinoid receptor 1
Name:Cannabinoid receptor 1
Type:G Protein-Coupled Receptor (GPCR)
Mol. Mass.:52856.55
Organism:Rattus norvegicus (rat)
Description:P20272
Residue:473
BDBM50107600
NameBDBM50107600
Synonyms:(5Z,8Z,11Z,14Z)-(tetrahydrofuran-2-yl)methyl icosa-5,8,11,14-tetraenoate CHEMBL287364 | Icosa-5,8,11,14-tetraenoic acid tetrahydro-furan-2-ylmethyl ester
TypeSmall organic molecule
Emp. Form.C25H40O3
Mol. Mass.388.5833
SMILESCCCCC\C=C/C\C=C/C\C=C/C\C=C/CCCC(=O)OCC1CCCO1