Reaction Details
Target5-hydroxytryptamine receptor 2A
LigandBDBM50004337
Substrate/Competitorn/a
Meas. Tech.ChEMBL_2300 (CHEMBL617085)
Ki 5.3±n/a nM
Citation Rowley, MBristow, LJHutson, PH Current and novel approaches to the drug treatment of schizophrenia. J Med Chem44:477-501 (2001) 5-hydroxytryptamine receptor 2A
Name:5-hydroxytryptamine receptor 2A
Type:undefined
Mol. Mass.:52607.65
Organism:Homo sapiens (Human)
Description:P28223
Residue:471
BDBM50004337
NameBDBM50004337
Synonyms:(4-Fluoro-phenyl)-[1-(4-phenyl-butyl)-piperidin-4-yl]-methanone CHEMBL1788135 | CHEMBL19259
TypeSmall organic molecule
Emp. Form.C22H26FNO
Mol. Mass.339.4463
SMILESFc1ccc(cc1)C(=O)C1CCN(CCCCc2ccccc2)CC1