Reaction Details
TargetSigma non-opioid intracellular receptor 1
LigandBDBM85093
Substrate/Competitorn/a
Meas. Tech.ChEMBL_226558 (CHEMBL847755)
Ki 130±n/a nM
Citation Rowley, MBristow, LJHutson, PH Current and novel approaches to the drug treatment of schizophrenia. J Med Chem44:477-501 (2001) Sigma non-opioid intracellular receptor 1
Name:Sigma non-opioid intracellular receptor 1
Type:Enzyme Catalytic Domain
Mol. Mass.:25124.85
Organism:Homo sapiens (Human)
Description:Q99720
Residue:223
BDBM85093
NameBDBM85093
Synonyms:CAS_3853 CHEMBL555670 NSC_3853
TypeSmall organic molecule
Emp. Form.C18H19ClN4
Mol. Mass.326.823
SMILESClc1ccc(cc1)N1CCN(Cc2c[nH]c3ncccc23)CC1