Reaction Details
TargetAdenosine receptor A2a
LigandBDBM50368336
Substrate/Competitorn/a
Meas. Tech.ChEMBL_30008 (CHEMBL641299)
Ki 10±n/a nM
Citation Rieger, JMBrown, MLSullivan, GWLinden, JMacdonald, TL Design, synthesis, and evaluation of novel A2A adenosine receptor agonists. J Med Chem44:531-9 (2001) Adenosine receptor A2a
Name:Adenosine receptor A2a
Type:G Protein-Coupled Receptor (GPCR)
Mol. Mass.:45015.65
Organism:Rattus norvegicus (rat)
Description:Rat A2A receptors expressed in CHO cells.
Residue:410
BDBM50368336
NameBDBM50368336
Synonyms:CHEMBL609493
TypeSmall organic molecule
Emp. Form.C18H23N5O4
Mol. Mass.373.4063
SMILESNc1nc(nc2n(cnc12)C1O[C@H](CO)[C@@H](O)[C@H]1O)C#CC1CCCCC1