Reaction Details
TargetAdenosine receptor A1
LigandBDBM50369983
Substrate/Competitorn/a
Meas. Tech.ChEMBL_29318 (CHEMBL642306)
Ki 154±n/a nM
Citation Rieger, JMBrown, MLSullivan, GWLinden, JMacdonald, TL Design, synthesis, and evaluation of novel A2A adenosine receptor agonists. J Med Chem44:531-9 (2001) Adenosine receptor A1
Name:Adenosine receptor A1
Type:Protein
Mol. Mass.:36704.13
Organism:Rattus norvegicus (rat)
Description:n/a
Residue:326
BDBM50369983
NameBDBM50369983
Synonyms:CHEMBL607775
TypeSmall organic molecule
Emp. Form.C13H19N5O4
Mol. Mass.309.3211
SMILESCCCc1nc(N)c2ncn(C3O[C@H](CO)[C@@H](O)[C@H]3O)c2n1