Reaction Details
TargetAdenosine receptor A1
LigandBDBM50369987
Substrate/Competitorn/a
Meas. Tech.ChEMBL_29318 (CHEMBL642306)
Ki 38.10±n/a nM
Citation Rieger, JMBrown, MLSullivan, GWLinden, JMacdonald, TL Design, synthesis, and evaluation of novel A2A adenosine receptor agonists. J Med Chem44:531-9 (2001) Adenosine receptor A1
Name:Adenosine receptor A1
Type:Protein
Mol. Mass.:36704.13
Organism:Rattus norvegicus (rat)
Description:n/a
Residue:326
BDBM50369987
NameBDBM50369987
Synonyms:CHEMBL608460
TypeSmall organic molecule
Emp. Form.C12H17N5O5
Mol. Mass.311.2939
SMILESCOCc1nc(N)c2ncn(C3O[C@H](CO)[C@@H](O)[C@H]3O)c2n1