Reaction Details
TargetAdenosine receptor A2a
LigandBDBM50369993
Substrate/Competitorn/a
Meas. Tech.ChEMBL_30008 (CHEMBL641299)
Ki 36±n/a nM
Citation Rieger, JMBrown, MLSullivan, GWLinden, JMacdonald, TL Design, synthesis, and evaluation of novel A2A adenosine receptor agonists. J Med Chem44:531-9 (2001) Adenosine receptor A2a
Name:Adenosine receptor A2a
Type:G Protein-Coupled Receptor (GPCR)
Mol. Mass.:45015.65
Organism:Rattus norvegicus (rat)
Description:Rat A2A receptors expressed in CHO cells.
Residue:410
BDBM50369993
NameBDBM50369993
Synonyms:CHEMBL607613
TypeSmall organic molecule
Emp. Form.C19H23N5O6
Mol. Mass.417.4158
SMILESCOc1ccccc1CCOc1nc(N)c2ncn(C3O[C@H](CO)[C@@H](O)[C@H]3O)c2n1