Reaction Details
TargetAdenosine receptor A2a
LigandBDBM50368339
Substrate/Competitorn/a
Meas. Tech.ChEMBL_30008 (CHEMBL641299)
Ki 6.5±n/a nM
Citation Rieger, JMBrown, MLSullivan, GWLinden, JMacdonald, TL Design, synthesis, and evaluation of novel A2A adenosine receptor agonists. J Med Chem44:531-9 (2001) Adenosine receptor A2a
Name:Adenosine receptor A2a
Type:G Protein-Coupled Receptor (GPCR)
Mol. Mass.:45015.65
Organism:Rattus norvegicus (rat)
Description:Rat A2A receptors expressed in CHO cells.
Residue:410
BDBM50368339
NameBDBM50368339
Synonyms:CHEMBL610651
TypeSmall organic molecule
Emp. Form.C19H25N5O4
Mol. Mass.387.4329
SMILESNc1nc(nc2n(cnc12)C1O[C@H](CO)[C@@H](O)[C@H]1O)C#CCC1CCCCC1