Reaction Details
TargetAdenosine receptor A2a
LigandBDBM50009263
Substrate/Competitorn/a
Meas. Tech.ChEMBL_30008 (CHEMBL641299)
Ki 2.2±n/a nM
Citation Rieger, JMBrown, MLSullivan, GWLinden, JMacdonald, TL Design, synthesis, and evaluation of novel A2A adenosine receptor agonists. J Med Chem44:531-9 (2001) Adenosine receptor A2a
Name:Adenosine receptor A2a
Type:G Protein-Coupled Receptor (GPCR)
Mol. Mass.:45015.65
Organism:Rattus norvegicus (rat)
Description:Rat A2A receptors expressed in CHO cells.
Residue:410
BDBM50009263
NameBDBM50009263
Synonyms:(2S,3S,4R,5R)-5-(6-amino-2-(hex-1-ynyl)-9H-purin-9-yl)-N-ethyl-3,4-dihydroxy-tetrahydrofuran-2-carboxamide CHEMBL75416 | tert-butyl 1-[3-(1-amino-2-benzyloxycarbamoylethylcarboxamido)-2-hydroxy-4-phenylbutyl]tetrahydro-1H-2-pyrrolecarboxylate
TypeSmall organic molecule
Emp. Form.C31H42N4O7
Mol. Mass.582.6878
SMILESCC(C)(C)OC(=O)C1CCCN1CC(O)[C@H](Cc1ccccc1)NC(=O)[C@H](CC(N)=O)NC(=O)OCc1ccccc1