Reaction Details
TargetAdenosine receptor A2a
LigandBDBM50015655
Substrate/Competitorn/a
Meas. Tech.ChEMBL_30008 (CHEMBL641299)
Ki 7.5±n/a nM
Citation Rieger, JMBrown, MLSullivan, GWLinden, JMacdonald, TL Design, synthesis, and evaluation of novel A2A adenosine receptor agonists. J Med Chem44:531-9 (2001) Adenosine receptor A2a
Name:Adenosine receptor A2a
Type:G Protein-Coupled Receptor (GPCR)
Mol. Mass.:45015.65
Organism:Rattus norvegicus (rat)
Description:Rat A2A receptors expressed in CHO cells.
Residue:410
BDBM50015655
NameBDBM50015655
Synonyms:(2S,3S,4R)-5-{(R)-6-Amino-2-[2-(4-chloro-phenyl)-ethylamino]-purin-9-yl}-3,4-dihydroxy-tetrahydro-furan-2-carboxylic acid ethylamide CHEMBL57706
TypeSmall organic molecule
Emp. Form.C20H24ClN7O4
Mol. Mass.461.902
SMILESCCNC(=O)[C@H]1OC([C@H](O)[C@@H]1O)n1cnc2c(N)nc(NCCc3ccc(Cl)cc3)nc12