Reaction Details
TargetAdenosine receptor A1
LigandBDBM50369085
Substrate/Competitorn/a
Meas. Tech.ChEMBL_29318 (CHEMBL642306)
Ki 497±n/a nM
Citation Rieger, JMBrown, MLSullivan, GWLinden, JMacdonald, TL Design, synthesis, and evaluation of novel A2A adenosine receptor agonists. J Med Chem44:531-9 (2001) Adenosine receptor A1
Name:Adenosine receptor A1
Type:Protein
Mol. Mass.:36704.13
Organism:Rattus norvegicus (rat)
Description:n/a
Residue:326
BDBM50369085
NameBDBM50369085
Synonyms:CHEMBL603602
TypeSmall organic molecule
Emp. Form.C20H20N6O5
Mol. Mass.424.41
SMILESCCNC(=O)[C@H]1OC([C@H](O)[C@@H]1O)n1cnc2c(N)nc(nc12)C#Cc1ccc(O)cc1